{"text_format":"1","workbook":"xlsx","n_sheets":12,"sheets":["Overview","Translation","1. Staff costs","2-3. Travel Costs&Costs of Stay","4. Equipment Costs","5. Subcontracting Costs","B. Special Mob Strand - Student","B. Special Mob Strand - Staff","Co-financing","Breakdown & Project Funding","Rates","UNIT COSTS & FUNDING RULES"],"not_rendered":{"charts":0,"images":2,"macros":1,"external_links":0,"defined_names":51,"comments":0,"pivot_tables":0},"unopened":[],"bounds":{"document_bytes":16777216,"sheet_cells":100000,"rows_first":2000,"rows_last":500,"rows_between":2000,"halvings":0,"cell_chars":16384,"cell_head_chars":4096},"cells_cut":0,"cells_raw":0,"read":"whole","date_system":"1900"}

{"sheet":"Overview","index":0,"n_rows":84,"n_cols":12,"rows_kept":84,"cut":false,"hidden":false,"merged":[[16,4,16,11],[6,1,6,11],[7,1,7,11],[8,1,8,11],[10,1,10,2],[11,1,11,2],[12,1,12,2],[15,1,15,11],[16,1,16,2],[12,4,12,11],[11,4,11,11],[10,4,10,11],[13,1,13,2],[13,3,13,11],[23,1,23,2],[27,1,27,11],[17,1,17,2],[18,1,18,2],[19,1,19,2],[20,1,20,2],[25,1,25,2],[21,1,21,2],[21,4,21,11],[25,4,25,11],[23,4,23,11],[20,4,20,11],[19,4,19,11],[18,4,18,11],[17,4,17,11]]}
[]
[]
[null,null,null,"Key Action 2: Cooperation for innovation and the exchange of good practices"]
[null,null,null,"Capacity building in the field of higher education"]
[]
[]
[null,"Before completing this table please read carefully the instructions available on "]
[null,"CALL FOR PROPOSALS 2015 – EAC/A04/2014 - Erasmus+ Programme"]
[null,"Programme guide and instructions for applicants"]
[]
{"$rows_left_out":75}
{"sheet":"Translation","index":1,"n_rows":69,"n_cols":4,"rows_kept":69,"cut":false,"hidden":true,"merged":[]}
["English","Français","Deutsch"]
[" (OPTIONAL)","(OPTION)","(fakultativ)"]
["1. Staff costs","Frais de Personnel","Personalkosten"]
["2. Travel costs","Frais  de voyage","Reisekosten"]
["24 months","24 mois","24 monate"]
["3. Costs of stay","Frais de séjour","Aufenthaltskosten"]
["36 months","36 mois","36 monate"]
["4. Equipment"]
["5. Subcontracting"]
["A – EU Grant requested for the project activities","Soutien à la mise en œuvre du projet","Unterstützung der Projektumsetzung"]
{"$rows_left_out":60}
{"sheet":"1. Staff costs","index":2,"n_rows":14,"n_cols":24,"rows_kept":14,"cut":false,"hidden":false,"merged":[[4,1,4,2],[3,1,3,2],[8,1,8,2],[2,1,2,22],[10,21,11,21],[10,23,11,23],[1,1,1,23],[10,22,11,22],[10,5,10,8],[10,9,10,12],[10,13,10,16],[10,17,10,20],[9,1,9,22],[3,5,8,22],[10,1,11,1],[10,4,11,4],[10,3,11,3],[10,2,11,2],[7,1,7,2],[6,1,6,2],[5,1,5,2]]}
[]
[null,"1. Staff Costs"]
[]
[null,null,null,"Number of Days","Total (EUR)"]
[null,"Manager",null,{"$f":"SUM(G:G)","v":0},{"$f":"SUM(I:I)","v":0}]
[null,"Teacher/Trainer/Researcher",null,{"$f":"SUM(K:K)","v":0},{"$f":"SUM(M:M)","v":0}]
[null,"Technician",null,{"$f":"SUM(O:O)","v":0},{"$f":"SUM(Q:Q)","v":0}]
[null,"Administrative",null,{"$f":"SUM(S:S)","v":0},{"$f":"SUM(U:U)","v":0}]
[null,null,null,{"$f":"SUM(D5:D8)","v":0},{"$f":"SUM(E5:E8)","v":0}]
[]
{"$rows_left_out":5}
{"sheet":"2-3. Travel Costs&Costs of Stay","index":3,"n_rows":14,"n_cols":15,"rows_kept":14,"cut":false,"hidden":false,"merged":[[10,14,11,14],[1,1,1,14],[10,5,11,5],[10,8,11,8],[10,7,11,7],[10,6,11,6],[10,4,11,4],[10,3,11,3],[10,13,11,13],[10,12,11,12],[10,11,11,11],[10,10,11,10],[10,9,11,9],[7,1,8,1],[5,1,6,1],[3,1,4,1],[7,2,8,3],[5,2,6,3],[3,2,4,3],[10,1,11,1],[10,2,11,2]]}
[]
[null,"2-3. Travel Costs & Costs of Stay"]
[]
[null,"Travel Costs",{"$f":"SUM(L:L)","v":0}]
[]
[null,"Costs of Stay",{"$f":"SUM(M:M)","v":0}]
[]
[null,"Total (EUR)",{"$f":"C4+C6","v":0}]
[]
[]
{"$rows_left_out":5}
{"sheet":"4. Equipment Costs","index":4,"n_rows":14,"n_cols":10,"rows_kept":14,"cut":false,"hidden":false,"merged":[[10,8,11,8],[1,1,1,8],[10,7,11,7],[10,6,11,6],[10,5,11,5],[10,4,11,4],[3,1,8,1],[3,2,8,3],[10,3,11,3],[10,1,11,1],[10,2,11,2]]}
[]
[null,"4. Equipment Costs"]
[]
[null,"Total (EUR)",{"$f":"SUM(H:H)","v":0}]
[]
[]
[]
[]
[]
[]
{"$rows_left_out":5}
{"sheet":"5. Subcontracting Costs","index":5,"n_rows":14,"n_cols":9,"rows_kept":14,"cut":false,"hidden":false,"merged":[[10,8,11,8],[1,1,1,8],[10,7,11,7],[3,1,8,1],[3,2,8,3],[10,1,11,1],[10,2,11,2],[10,3,11,3],[10,4,11,4],[10,5,11,5],[10,6,11,6]]}
[]
[null,"5. Subcontracting Costs"]
[]
[null,"Total (EUR)",{"$f":"SUM(H:H)","v":0}]
[]
[]
[]
[]
[]
[]
{"$rows_left_out":5}
{"sheet":"B. Special Mob Strand - Student","index":6,"n_rows":14,"n_cols":18,"rows_kept":14,"cut":false,"hidden":false,"merged":[[10,1,11,1],[10,2,11,2],[10,3,11,3],[10,4,11,4],[10,6,11,6],[10,14,11,14],[1,1,1,14],[10,10,11,10],[10,11,11,11],[10,12,11,12],[10,13,11,13],[10,8,11,8],[10,9,11,9],[3,1,4,1],[3,2,4,2],[5,1,6,1],[5,2,6,2],[7,1,8,1],[7,2,8,2],[10,5,11,5],[10,7,11,7]]}
[]
[null,"B. Special Mobility Strand - Student"]
[]
[null,"Travel Costs",{"$f":"SUM(L:L)","v":0}]
[]
[null,"Subsistence Costs",{"$f":"SUM(M:M)","v":0}]
[]
[null,"Total (EUR)",{"$f":"C4+C6","v":0}]
[]
[]
{"$rows_left_out":5}
{"sheet":"B. Special Mob Strand - Staff","index":7,"n_rows":14,"n_cols":18,"rows_kept":14,"cut":false,"hidden":false,"merged":[[10,3,11,3],[3,1,4,1],[3,2,4,2],[5,1,6,1],[5,2,6,2],[10,14,11,14],[1,1,1,14],[10,4,11,4],[10,5,11,5],[10,13,11,13],[10,7,11,7],[10,8,11,8],[10,9,11,9],[10,10,11,10],[10,11,11,11],[10,12,11,12],[10,6,11,6],[7,1,8,1],[7,2,8,2],[10,1,11,1],[10,2,11,2]]}
[]
[null,"B. Special Mobility Strand - Staff"]
[]
[null,"Travel Costs",{"$f":"SUM(L:L)","v":0}]
[]
[null,"Subsistence Costs",{"$f":"SUM(M:M)","v":0}]
[]
[null,"Total (EUR)",{"$f":"C4+C6","v":0}]
[]
[]
{"$rows_left_out":5}
{"sheet":"Co-financing","index":8,"n_rows":18,"n_cols":10,"rows_kept":18,"cut":false,"hidden":false,"merged":[[10,9,11,9],[1,1,1,9],[10,8,11,8],[10,5,11,5],[3,2,8,2],[3,1,8,1],[10,1,11,1],[10,2,11,2],[10,3,11,3],[10,6,11,6],[10,7,11,7],[10,4,11,4]]}
[]
[null,"Information for the Co-financing"]
[]
[null,"Total (EUR)",{"$f":"SUM(I:I)","v":0}]
[]
[]
[]
[]
[]
[]
{"$rows_left_out":9}
{"sheet":"Breakdown & Project Funding","index":9,"n_rows":81,"n_cols":9,"rows_kept":81,"cut":false,"hidden":false,"merged":[[1,1,1,8],[13,1,13,8],[4,7,8,7],[22,1,22,8]]}
[]
[null,"Budget Breakdown by Workpackage / Budget Headings"]
[]
[null,"Work\nPackage","1. Staff \nCosts","2. Travel \nCosts","3. Costs \nof Stay","4. Equipment\nCosts","5. Subcontracting\nCosts","B. Special \nMobility Strand","Total\n(EUR)"]
[null,"Preparation",{"$f":"SUMIF('1. Staff costs'!B:B,B5,'1. Staff costs'!W:W)","v":0},{"$f":"SUMIF('2-3. Travel Costs&Costs of Stay'!B:B,B5,'2-3. Travel Costs&Costs of Stay'!L:L)","v":0},{"$f":"SUMIF('2-3. Travel Costs&Costs of Stay'!B:B,B5,'2-3. Travel Costs&Costs of Stay'!M:M)","v":0},{"$f":"SUMIF('4. Equipment Costs'!B:B,B5,'4. Equipment Costs'!H:H)","v":0},{"$f":"SUMIF('5. Subcontracting Costs'!B:B,B5,'5. Subcontracting Costs'!H:H)","v":0},null,{"$f":"SUM(C5:G5)","v":0}]
[null,"Development",{"$f":"SUMIF('1. Staff costs'!B:B,B6,'1. Staff costs'!W:W)","v":0},{"$f":"SUMIF('2-3. Travel Costs&Costs of Stay'!B:B,B6,'2-3. Travel Costs&Costs of Stay'!L:L)","v":0},{"$f":"SUMIF('2-3. Travel Costs&Costs of Stay'!B:B,B6,'2-3. Travel Costs&Costs of Stay'!M:M)","v":0},{"$f":"SUMIF('4. Equipment Costs'!B:B,B6,'4. Equipment Costs'!H:H)","v":0},{"$f":"SUMIF('5. Subcontracting Costs'!B:B,B6,'5. Subcontracting Costs'!H:H)","v":0},null,{"$f":"SUM(C6:G6)","v":0}]
[null,"Quality",{"$f":"SUMIF('1. Staff costs'!B:B,B7,'1. Staff costs'!W:W)","v":0},{"$f":"SUMIF('2-3. Travel Costs&Costs of Stay'!B:B,B7,'2-3. Travel Costs&Costs of Stay'!L:L)","v":0},{"$f":"SUMIF('2-3. Travel Costs&Costs of Stay'!B:B,B7,'2-3. Travel Costs&Costs of Stay'!M:M)","v":0},{"$f":"SUMIF('4. Equipment Costs'!B:B,B7,'4. Equipment Costs'!H:H)","v":0},{"$f":"SUMIF('5. Subcontracting Costs'!B:B,B7,'5. Subcontracting Costs'!H:H)","v":0},null,0]
[null,"Dissemination/Exploitation",{"$f":"SUMIF('1. Staff costs'!B:B,B8,'1. Staff costs'!W:W)","v":0},{"$f":"SUMIF('2-3. Travel Costs&Costs of Stay'!B:B,B8,'2-3. Travel Costs&Costs of Stay'!L:L)","v":0},{"$f":"SUMIF('2-3. Travel Costs&Costs of Stay'!B:B,B8,'2-3. Travel Costs&Costs of Stay'!M:M)","v":0},{"$f":"SUMIF('4. Equipment Costs'!B:B,B8,'4. Equipment Costs'!H:H)","v":0},{"$f":"SUMIF('5. Subcontracting Costs'!B:B,B8,'5. Subcontracting Costs'!H:H)","v":0},null,0]
[null,"Management",{"$f":"SUMIF('1. Staff costs'!B:B,B9,'1. Staff costs'!W:W)","v":0},{"$f":"SUMIF('2-3. Travel Costs&Costs of Stay'!B:B,B9,'2-3. Travel Costs&Costs of Stay'!L:L)","v":0},{"$f":"SUMIF('2-3. Travel Costs&Costs of Stay'!B:B,B9,'2-3. Travel Costs&Costs of Stay'!M:M)","v":0},{"$f":"SUMIF('4. Equipment Costs'!B:B,B9,'4. Equipment Costs'!H:H)","v":0},{"$f":"SUMIF('5. Subcontracting Costs'!B:B,B9,'5. Subcontracting Costs'!H:H)","v":0},null,0]
[null,"Total",{"$f":"SUM(C5:C9)","v":0},0,0,0,{"$f":"SUM(G5:G9)","v":0},{"$f":"'B. Special Mob Strand - Student'!C8+'B. Special Mob Strand - Staff'!C8","v":0},{"$f":"SUM(C10:H10)","v":0}]
{"$rows_left_out":72}
{"sheet":"Rates","index":10,"n_rows":369,"n_cols":26,"rows_kept":369,"cut":false,"hidden":true,"merged":[[12,9,12,10],[13,9,13,10],[14,9,14,10],[15,9,15,10],[16,9,16,10],[1,9,1,10],[1,1,1,7],[1,12,1,18],[1,20,1,22],[11,9,11,10]]}
[]
[null,"Staff Costs",null,null,null,null,null,null,null,"Travel Costs",null,null,"Subsistence Mobility Strand",null,null,null,null,null,null,null,"Costs of Stay"]
[]
[null,"Country","Iso Code","PR/PA","Manager","Teacher/Trainer/Researcher","Technician","Administrative",null,"Distance","Travel \nCosts\n(EUR)",null,"Country","Iso Code","PR/PA","Students from Partner Countries","Students from Programme Countries","Staff from Partner Countries","Staff from Programme Countries",null,"Number of \nDays","Staff","Student",null,"Staff","Student"]
[null,"Austria","AT","Programme Countries",294,241,190,157,null,"100 KM and 499 KM",180,null,"Austria","AT","Programme Countries",850,0,140,0,null,1,{"$f":"120*U5","v":120},{"$f":"55*U5","v":55},null,1,1]
[null,"Belgium","BE","Programme Countries",280,214,162,131,null,"500 KM and 1999 KM",275,null,"Belgium","BE","Programme Countries",800,0,140,0,null,2,{"$f":"120*U6","v":240},{"$f":"55*U6","v":110},null,2,2]
[null,"Bulgaria","BG","Programme Countries",88,74,55,39,null,"2000 KM and 2999 KM",360,null,"Bulgaria","BG","Programme Countries",750,0,140,0,null,3,360,165,null,3,3]
[null,"Croatia","HR","Programme Countries",88,74,55,39,null,"3000 KM and 3999 KM",530,null,"Croatia","HR","Programme Countries",800,0,100,0,null,4,480,220,null,4,4]
[null,"Cyprus","CY","Programme Countries",164,137,102,78,null,"4000 KM and 7999 KM",820,null,"Cyprus","CY","Programme Countries",800,0,140,0,null,5,600,275,null,5,5]
[null,"Czech Republic","CZ","Programme Countries",164,137,102,78,null,"8000 KM or more",1100,null,"Czech Republic","CZ","Programme Countries",800,0,140,0,null,6,720,330,null,6,6]
{"$rows_left_out":360}
{"sheet":"UNIT COSTS & FUNDING RULES","index":11,"n_rows":372,"n_cols":29,"rows_kept":372,"cut":false,"hidden":false,"merged":[[4,22,4,28],[5,22,5,28],[0,0,0,28],[3,0,3,6],[3,8,3,9],[3,11,3,13],[3,15,3,16],[3,18,3,20],[3,22,3,28],[2,1,2,7],[1,1,1,7],[6,15,6,16],[6,18,6,20],[4,0,5,6],[4,8,5,9],[4,11,5,13],[4,15,5,16],[4,18,5,20]]}
["UNIT COSTS AND SUMMARY OF THE FUNDING RULES FOR  JOINT AND STRUCTURAL CAPACITY BUILDING PROJECTS\n\nYou can find below the unit costs values used in this file for the calculation of the grant.\nPlease refer to the Erasmus+ Programme guide 2015* for a complete overview of the funding rules applying to the Joint and Structural Capacity Building Projects ( i.e. in Part B from page 157 to page 165, and Annex 1 from page 287 to page 294)."]
["* Link to Erasmus+ Programme guide 2015: ","http://ec.europa.eu/programmes/erasmus-plus/documents/erasmus-plus-programme-guide_en.pdf"]
["* Link to CBHE Call for proposal, forms, annexes and guidelines: ","https://eacea.ec.europa.eu/erasmus-plus/funding/key-action-2-capacity-building-in-field-higher-education-2015_en"]
["A.1 Staff Costs",null,null,null,null,null,null,null,"A.2 & B Travel Costs",null,null,"A. 3 Costs of Stay",null,null,null,"A.4 Equipment",null,null,"A.5 Subcontracting",null,null,null,"B - Special Mobility Strand"]
["Unit costs\n\nContribution to the costs of staff performing tasks which are directly necessary to the achievements of the objectives of the project .\n\nConditional: applicants will have to justify the type and volume of resources needed in relation to the implementation of the proposed activities and outputs. The contribution is provided on the  condition that the salary for the same tasks is compensated only once.",null,null,null,null,null,null,null,"Unit costs based on the travel distance per participant. \n\nTravel distances must be calculated using the distance calculator supported by the European Commission . \nThe applicant must indicate the distance of a one-way travel to calculate the amount of the EU grant that will support the round trip",null,null,"Costs for subsistence, accommodation, local and public transport such as bus and taxi, personal or optional health insurance.\n\nUnit costs based on the duration of the stay of the participants:\nStaff: 120 EUR / day from day 1 to day 14 + 70 EUR/ day from day 15 to day 60 + 50 EUR / day  between day 61 and up to 12 months.\nStudent: 55 EUR / day from day 1 to day 14 + 40 EUR/ day from day 15 to day 60.",null,null,null,"Contribution for the purchase of equipment necessary for the implementation of the project. Support is provided only for equipment purchased by HEIs in Partner Countries \n\nConditional: the request for financial support to cover these costs must be motivated in the application form",null,null,"Support for sub-contracting costs that are necessary to the implementation of the project, including, in particular, costs for the compulsory financial audits (audit certificate) and for any external quality assurance procedure.\n\nSub-contracting for project-management-related tasks is not eligible.\nSub-contracting to external bodies should be very occasional. The specific competences and particular expertise needed to reach the project objectives should be found in the consortium and should determine its composition.",null,null,null,"Travel costs (students and staff):  Unit costs (please refer to unit costs in table A2).\nContribution to the travel costs of students and staff involved in theMobilitu project, from their place of origin to the venue of the activity and return (including visa fee and related obligatory insurance, travel insurance and cancellation costs if justified).\nActivities and related travels must be carried out in the countries involved in the project. Any exception to this rule must be authorised by the Agency.For the detailed list of eligible activities, see Annex I of this Guide.\n\nSubsistence costs:  Unit costs based on the duration of the stay of the participants.\nCosts for subsistence, accommodation, local and public transport such as bus and taxi, personal or optional health insurance. Based on the duration of the stay per participant."]
[null,null,null,null,null,null,null,null,null,null,null,null,null,null,null,null,null,null,null,null,null,null,"Subsistence costs for Special Mobility Strand"]
["Country","Iso Code","PR/PA","Manager","Teacher/Trainer/Researcher","Technician","Administrative",null,"Distance","Travel \nCosts\n(EUR)",null,"Number of \nDays","Staff","Student",null,"Real costs\nMax. 30% of the total grant",null,null,"Real costs\nMax. 10% of the total grant",null,null,null,"Country","Iso Code","PR/PA","Students from Partner Countries","Students from Programme Countries","Staff from Partner Countries","Staff from Programme Countries"]
["Austria","AT","Programme Countries",294,241,190,157,null,"100 KM and 499 KM",180,null,1,120,55,null,null,null,null,null,null,null,null,"Austria","AT","Programme Countries",850,0,140,0]
["Belgium","BE","Programme Countries",280,214,162,131,null,"500 KM and 1999 KM",275,null,2,240,110,null,null,null,null,null,null,null,null,"Belgium","BE","Programme Countries",800,0,140,0]
["Bulgaria","BG","Programme Countries",88,74,55,39,null,"2000 KM and 2999 KM",360,null,3,360,165,null,null,null,null,null,null,null,null,"Bulgaria","BG","Programme Countries",750,0,140,0]
{"$rows_left_out":362}